{"text_format":"1","workbook":"xlsx","n_sheets":4,"sheets":["Instructions","Run Chart","Makeup","Math-DO-NOT-Delete"],"not_rendered":{"charts":0,"images":4,"macros":0,"external_links":0,"defined_names":2,"comments":0,"pivot_tables":0},"unopened":[],"bounds":{"document_bytes":16777216,"sheet_cells":100000,"rows_first":2000,"rows_last":500,"rows_between":2000,"halvings":0,"cell_chars":16384,"cell_head_chars":4096},"cells_cut":0,"cells_raw":0,"read":"whole","date_system":"1900"}

{"sheet":"Instructions","index":0,"n_rows":38,"n_cols":2,"rows_kept":38,"cut":false,"hidden":false,"merged":[]}
[null,"Updated : 2025-05-07"]
[null,"INSTRUCTIONS"]
[]
[null,"RUN CHART"]
[null,"1. Click on the cell to the right of the word \"Product:\", then click on the arrow that appears and select the product that you want."]
[null,"2. The chart will draw a scale on the side and the white, yellow, and the red plotting area based on the refractive reading for a usual percent concentration range and target concentration."]
[null,"(Customize the Run Chart to fit your operating parameters by simply changing the Percent Concentration: Min, Target, and Max numbers in the GREEN boxes) "]
[null,"3. Print the chart and post it on your machine. "]
[null,"4. Plot the Refractive Reading of the sump everyday. Stay in the white zone close to the target Refractive Reading."]
[]
{"$rows_left_out":29}
{"sheet":"Run Chart","index":1,"n_rows":65,"n_cols":66,"rows_kept":65,"cut":false,"hidden":false,"merged":[[63,1,63,66],[61,1,61,3],[60,1,60,3],[61,35,61,65],[62,1,62,3],[62,4,62,10],[62,50,62,57],[62,58,62,65],[62,35,62,41],[62,42,62,49],[62,11,62,18],[62,19,62,26],[62,27,62,34],[61,4,61,34],[4,45,4,65],[5,45,5,65],[6,1,59,2],[6,3,7,3],[30,3,31,3],[4,18,4,20],[4,21,4,22],[4,37,4,38],[14,3,15,3],[12,3,13,3],[10,3,11,3],[8,3,9,3],[18,3,19,3],[44,3,45,3],[20,3,21,3],[22,3,23,3],[3,43,3,44],[5,39,5,42],[4,39,4,42],[5,43,5,44],[4,43,4,44],[26,3,27,3],[28,3,29,3],[46,3,47,3],[48,3,49,3],[3,39,3,42],[3,37,3,38],[5,37,5,38],[4,1,4,4],[4,5,4,16],[5,4,5,22],[5,1,5,2],[4,23,4,36],[5,23,5,36],[0,7,3,33],[0,37,0,50],[1,37,1,50],[2,48,2,64],[3,48,3,64],[64,1,64,65],[58,3,59,3],[42,3,43,3],[50,3,51,3],[52,3,53,3],[54,3,55,3],[56,3,57,3],[32,3,33,3],[34,3,35,3],[36,3,37,3],[38,3,39,3],[40,3,41,3],[16,3,17,3],[24,3,25,3]]}
[null,null,null,null,null,null,null,"TRIM® RUN CHART",null,null,null,null,null,null,null,null,null,null,null,null,null,null,null,null,null,null,null,null,null,null,null,null,null,null,null,null,null,"Techline Assistance: 800-537-3365"]
[null,null,null,null,null,null,null,null,null,null,null,null,null,null,null,null,null,null,null,null,null,null,null,null,null,null,null,null,null,null,null,null,null,null,null,null,null,"info@masterchemical.com"]
[]
[null,null,null,null,null,null,null,null,null,null,null,null,null,null,null,null,null,null,null,null,null,null,null,null,null,null,null,null,null,null,null,null,null,null,null,null,null,"Min",null,"Target",null,null,null,"Max"]
[null," Product:",null,null,null,"TRIM® HyperSol™ 888NXT",null,null,null,null,null,null,null,null,null,null,null,null,"Brix:",null,null,{"$f":"VLOOKUP($F$5, 'Math-DO-NOT-Delete'!$A$2:$G$50,2,FALSE)","v":"2.2"},null,"Percent Concentration:",null,null,null,null,null,null,null,null,null,null,null,null,null,{"$f":"VLOOKUP($F$5, 'Math-DO-NOT-Delete'!$A$2:$G$50,5, FALSE)","v":5},null,{"$f":"VLOOKUP($F$5, 'Math-DO-NOT-Delete'!$A$2:$G$50,6, FALSE)","v":8},null,null,null,{"$f":"VLOOKUP($F$5, 'Math-DO-NOT-Delete'!$A$2:$G$50,7, FALSE)","v":12},null," Company:"]
[null,"Step:",null,{"$f":"ROUNDUP((($AR$6-$AL$6)*'Math-DO-NOT-Delete'!I2)/'Math-DO-NOT-Delete'!I3,1)","v":0.30000000000000004}," Check Refractometer Reading and Top Off Daily",null,null,null,null,null,null,null,null,null,null,null,null,null,null,null,null,null,null,"Refractometer Reading:",null,null,null,null,null,null,null,null,null,null,null,null,null,{"$f":"AL5/$V5","v":2.2727272727272725},null,{"$f":"ROUNDUP((AN5/$V5),1)","v":3.7},null,null,null,{"$f":"AR5/$V5","v":5.4545454545454541},null," Machine:"]
[null,null,null,{"$f":"D9 +$D$6","v":7.5999999999999979},{"$f":"$D7","v":7.5999999999999979},7.5999999999999979,7.5999999999999979,7.5999999999999979,7.5999999999999979,7.5999999999999979,7.5999999999999979,7.5999999999999979,7.5999999999999979,7.5999999999999979,7.5999999999999979,7.5999999999999979,7.5999999999999979,7.5999999999999979,7.5999999999999979,7.5999999999999979,{"$f":"$D7","v":7.5999999999999979},7.5999999999999979,7.5999999999999979,7.5999999999999979,7.5999999999999979,7.5999999999999979,7.5999999999999979,7.5999999999999979,7.5999999999999979,7.5999999999999979,7.5999999999999979,7.5999999999999979,7.5999999999999979,7.5999999999999979,7.5999999999999979,7.5999999999999979,7.5999999999999979,7.5999999999999979,7.5999999999999979,7.5999999999999979,7.5999999999999979,7.5999999999999979,7.5999999999999979,7.5999999999999979,7.5999999999999979,7.5999999999999979,7.5999999999999979,7.5999999999999979,7.5999999999999979,7.5999999999999979,7.5999999999999979,7.5999999999999979,7.5999999999999979,7.5999999999999979,7.5999999999999979,7.5999999999999979,7.5999999999999979,7.5999999999999979,7.5999999999999979,7.5999999999999979,7.5999999999999979,7.5999999999999979,7.5999999999999979,7.5999999999999979,7.5999999999999979,7.5999999999999979]
[null,null,null,null,{"$f":"$D7-$D$6*0.5","v":7.4499999999999975},7.4499999999999975,7.4499999999999975,7.4499999999999975,7.4499999999999975,7.4499999999999975,7.4499999999999975,7.4499999999999975,7.4499999999999975,7.4499999999999975,7.4499999999999975,7.4499999999999975,7.4499999999999975,7.4499999999999975,7.4499999999999975,7.4499999999999975,7.4499999999999975,7.4499999999999975,7.4499999999999975,7.4499999999999975,7.4499999999999975,7.4499999999999975,7.4499999999999975,7.4499999999999975,7.4499999999999975,7.4499999999999975,7.4499999999999975,7.4499999999999975,7.4499999999999975,7.4499999999999975,7.4499999999999975,7.4499999999999975,7.4499999999999975,7.4499999999999975,7.4499999999999975,7.4499999999999975,7.4499999999999975,7.4499999999999975,7.4499999999999975,7.4499999999999975,7.4499999999999975,7.4499999999999975,7.4499999999999975,7.4499999999999975,7.4499999999999975,7.4499999999999975,7.4499999999999975,7.4499999999999975,7.4499999999999975,7.4499999999999975,7.4499999999999975,7.4499999999999975,7.4499999999999975,7.4499999999999975,7.4499999999999975,7.4499999999999975,7.4499999999999975,7.4499999999999975,7.4499999999999975,7.4499999999999975,7.4499999999999975,7.4499999999999975]
[null,null,null,{"$f":"D11 +$D$6","v":7.299999999999998},7.299999999999998,7.299999999999998,7.299999999999998,7.299999999999998,7.299999999999998,7.299999999999998,7.299999999999998,7.299999999999998,7.299999999999998,7.299999999999998,7.299999999999998,7.299999999999998,7.299999999999998,7.299999999999998,7.299999999999998,7.299999999999998,7.299999999999998,7.299999999999998,7.299999999999998,7.299999999999998,7.299999999999998,7.299999999999998,7.299999999999998,7.299999999999998,7.299999999999998,7.299999999999998,7.299999999999998,7.299999999999998,7.299999999999998,7.299999999999998,7.299999999999998,7.299999999999998,7.299999999999998,7.299999999999998,7.299999999999998,7.299999999999998,7.299999999999998,7.299999999999998,7.299999999999998,7.299999999999998,7.299999999999998,7.299999999999998,7.299999999999998,7.299999999999998,7.299999999999998,7.299999999999998,7.299999999999998,7.299999999999998,7.299999999999998,7.299999999999998,7.299999999999998,7.299999999999998,7.299999999999998,7.299999999999998,7.299999999999998,7.299999999999998,7.299999999999998,7.299999999999998,7.299999999999998,7.299999999999998,7.299999999999998,7.299999999999998]
[null,null,null,null,{"$f":"$D9-$D$6*0.5","v":7.1499999999999977},7.1499999999999977,7.1499999999999977,7.1499999999999977,7.1499999999999977,7.1499999999999977,7.1499999999999977,7.1499999999999977,7.1499999999999977,7.1499999999999977,7.1499999999999977,7.1499999999999977,7.1499999999999977,7.1499999999999977,7.1499999999999977,7.1499999999999977,7.1499999999999977,7.1499999999999977,7.1499999999999977,7.1499999999999977,7.1499999999999977,7.1499999999999977,7.1499999999999977,7.1499999999999977,7.1499999999999977,7.1499999999999977,7.1499999999999977,7.1499999999999977,7.1499999999999977,7.1499999999999977,7.1499999999999977,7.1499999999999977,7.1499999999999977,7.1499999999999977,7.1499999999999977,7.1499999999999977,7.1499999999999977,7.1499999999999977,7.1499999999999977,7.1499999999999977,7.1499999999999977,7.1499999999999977,7.1499999999999977,7.1499999999999977,7.1499999999999977,7.1499999999999977,7.1499999999999977,7.1499999999999977,7.1499999999999977,7.1499999999999977,7.1499999999999977,7.1499999999999977,7.1499999999999977,7.1499999999999977,7.1499999999999977,7.1499999999999977,7.1499999999999977,7.1499999999999977,7.1499999999999977,7.1499999999999977,7.1499999999999977,7.1499999999999977]
{"$rows_left_out":56}
{"sheet":"Makeup","index":2,"n_rows":65,"n_cols":66,"rows_kept":65,"cut":false,"hidden":false,"merged":[[0,37,0,50],[1,37,1,50],[0,7,3,33],[62,42,62,49],[62,50,62,57],[5,43,5,44],[5,45,5,65],[4,37,4,38],[4,39,4,42],[4,43,4,44],[4,45,4,65],[5,39,5,42],[4,27,4,36],[2,48,2,64],[3,37,3,38],[3,39,3,42],[61,35,61,65],[44,3,45,3],[46,3,47,3],[48,3,49,3],[50,3,51,3],[52,3,53,3],[54,3,55,3],[56,3,57,3],[58,3,59,3],[60,1,60,3],[61,1,61,3],[61,4,61,34],[6,1,59,2],[6,3,7,3],[8,3,9,3],[10,3,11,3],[64,1,64,65],[62,1,62,3],[62,4,62,10],[62,11,62,18],[62,19,62,26],[62,27,62,34],[62,35,62,41],[62,58,62,65],[63,1,63,66],[12,3,13,3],[14,3,15,3],[16,3,17,3],[18,3,19,3],[42,3,43,3],[20,3,21,3],[22,3,23,3],[24,3,25,3],[26,3,27,3],[28,3,29,3],[30,3,31,3],[32,3,33,3],[34,3,35,3],[36,3,37,3],[38,3,39,3],[40,3,41,3],[5,1,5,2],[5,4,5,22],[5,23,5,25],[5,27,5,36],[5,37,5,38],[3,43,3,44],[3,48,3,64],[4,1,4,4],[4,5,4,16],[4,18,4,20],[4,21,4,22],[4,23,4,26]]}
[null,null,null,null,null,null,null,"TRIM® RUN CHART",null,null,null,null,null,null,null,null,null,null,null,null,null,null,null,null,null,null,null,null,null,null,null,null,null,null,null,null,null,"Techline Assistance: 800-537-3365"]
[null,null,null,null,null,null,null,null,null,null,null,null,null,null,null,null,null,null,null,null,null,null,null,null,null,null,null,null,null,null,null,null,null,null,null,null,null,"info@masterchemical.com"]
[]
[null,null,null,null,null,null,null,null,null,null,null,null,null,null,null,null,null,null,null,null,null,null,null,null,null,null,null,null,null,null,null,null,null,null,null,null,null,"Min",null,"Target",null,null,null,"Max"]
[null," Product:",null,null,null,"TRIM® HyperSol™ 888NXT",null,null,null,null,null,null,null,null,null,null,null,null,"Brix:",null,null,{"$f":"VLOOKUP($F$5, 'Math-DO-NOT-Delete'!$A$2:$G$50,2,FALSE)","v":"2.2"},null,"Makeup",null,null,null,"Percent Concentration:",null,null,null,null,null,null,null,null,null,{"$f":"VLOOKUP($F$5, 'Math-DO-NOT-Delete'!$A$2:$G$50,5, FALSE)*$X6","v":2},null,{"$f":"VLOOKUP($F$5, 'Math-DO-NOT-Delete'!$A$2:$G$50,6, FALSE)*$X6","v":3.2},null,null,null,{"$f":"VLOOKUP($F$5, 'Math-DO-NOT-Delete'!$A$2:$G$50,7, FALSE)*$X6","v":4.8000000000000007},null," Company:"]
[null,"Step:",null,{"$f":"ROUNDUP((($AR$6-$AL$6)*'Math-DO-NOT-Delete'!I2)/'Math-DO-NOT-Delete'!I3,1)","v":0.1}," Check Refractometer Reading and Top Off Daily",null,null,null,null,null,null,null,null,null,null,null,null,null,null,null,null,null,null,0.4,null,null,null,"Refractometer Reading:",null,null,null,null,null,null,null,null,null,{"$f":"AL5/$V5","v":0.90909090909090906},null,{"$f":"ROUNDUP((AN5/$V5),1)","v":1.5},null,null,null,{"$f":"AR5/$V5","v":2.1818181818181821},null," Machine:"]
[null,null,null,{"$f":"D9 +$D$6","v":2.8000000000000012},{"$f":"$D7","v":2.8000000000000012},2.8000000000000012,2.8000000000000012,2.8000000000000012,2.8000000000000012,2.8000000000000012,2.8000000000000012,2.8000000000000012,2.8000000000000012,2.8000000000000012,2.8000000000000012,2.8000000000000012,2.8000000000000012,2.8000000000000012,2.8000000000000012,2.8000000000000012,{"$f":"$D7","v":2.8000000000000012},2.8000000000000012,2.8000000000000012,2.8000000000000012,2.8000000000000012,2.8000000000000012,2.8000000000000012,2.8000000000000012,2.8000000000000012,2.8000000000000012,2.8000000000000012,2.8000000000000012,2.8000000000000012,2.8000000000000012,2.8000000000000012,2.8000000000000012,2.8000000000000012,2.8000000000000012,2.8000000000000012,2.8000000000000012,2.8000000000000012,2.8000000000000012,2.8000000000000012,2.8000000000000012,2.8000000000000012,2.8000000000000012,2.8000000000000012,2.8000000000000012,2.8000000000000012,2.8000000000000012,2.8000000000000012,2.8000000000000012,2.8000000000000012,2.8000000000000012,2.8000000000000012,2.8000000000000012,2.8000000000000012,2.8000000000000012,2.8000000000000012,2.8000000000000012,2.8000000000000012,2.8000000000000012,2.8000000000000012,2.8000000000000012,2.8000000000000012,2.8000000000000012]
[null,null,null,null,{"$f":"$D7-$D$6*0.5","v":2.7500000000000013},2.7500000000000013,2.7500000000000013,2.7500000000000013,2.7500000000000013,2.7500000000000013,2.7500000000000013,2.7500000000000013,2.7500000000000013,2.7500000000000013,2.7500000000000013,2.7500000000000013,2.7500000000000013,2.7500000000000013,2.7500000000000013,2.7500000000000013,2.7500000000000013,2.7500000000000013,2.7500000000000013,2.7500000000000013,2.7500000000000013,2.7500000000000013,2.7500000000000013,2.7500000000000013,2.7500000000000013,2.7500000000000013,2.7500000000000013,2.7500000000000013,2.7500000000000013,2.7500000000000013,2.7500000000000013,2.7500000000000013,2.7500000000000013,2.7500000000000013,2.7500000000000013,2.7500000000000013,2.7500000000000013,2.7500000000000013,2.7500000000000013,2.7500000000000013,2.7500000000000013,2.7500000000000013,2.7500000000000013,2.7500000000000013,2.7500000000000013,2.7500000000000013,2.7500000000000013,2.7500000000000013,2.7500000000000013,2.7500000000000013,2.7500000000000013,2.7500000000000013,2.7500000000000013,2.7500000000000013,2.7500000000000013,2.7500000000000013,2.7500000000000013,2.7500000000000013,2.7500000000000013,2.7500000000000013,2.7500000000000013,2.7500000000000013]
[null,null,null,{"$f":"D11 +$D$6","v":2.7000000000000011},2.7000000000000011,2.7000000000000011,2.7000000000000011,2.7000000000000011,2.7000000000000011,2.7000000000000011,2.7000000000000011,2.7000000000000011,2.7000000000000011,2.7000000000000011,2.7000000000000011,2.7000000000000011,2.7000000000000011,2.7000000000000011,2.7000000000000011,2.7000000000000011,{"$f":"$D9","v":2.7000000000000011},2.7000000000000011,2.7000000000000011,2.7000000000000011,2.7000000000000011,2.7000000000000011,2.7000000000000011,2.7000000000000011,2.7000000000000011,2.7000000000000011,2.7000000000000011,2.7000000000000011,2.7000000000000011,2.7000000000000011,2.7000000000000011,2.7000000000000011,2.7000000000000011,2.7000000000000011,2.7000000000000011,2.7000000000000011,2.7000000000000011,2.7000000000000011,2.7000000000000011,2.7000000000000011,2.7000000000000011,2.7000000000000011,2.7000000000000011,2.7000000000000011,2.7000000000000011,2.7000000000000011,2.7000000000000011,2.7000000000000011,2.7000000000000011,2.7000000000000011,2.7000000000000011,2.7000000000000011,2.7000000000000011,2.7000000000000011,2.7000000000000011,2.7000000000000011,2.7000000000000011,2.7000000000000011,2.7000000000000011,2.7000000000000011,2.7000000000000011,2.7000000000000011]
[null,null,null,null,{"$f":"$D9-$D$6*0.5","v":2.6500000000000012},2.6500000000000012,2.6500000000000012,2.6500000000000012,2.6500000000000012,2.6500000000000012,2.6500000000000012,2.6500000000000012,2.6500000000000012,2.6500000000000012,2.6500000000000012,2.6500000000000012,2.6500000000000012,2.6500000000000012,2.6500000000000012,2.6500000000000012,2.6500000000000012,2.6500000000000012,2.6500000000000012,2.6500000000000012,2.6500000000000012,2.6500000000000012,2.6500000000000012,2.6500000000000012,2.6500000000000012,2.6500000000000012,2.6500000000000012,2.6500000000000012,2.6500000000000012,2.6500000000000012,2.6500000000000012,2.6500000000000012,2.6500000000000012,2.6500000000000012,2.6500000000000012,2.6500000000000012,2.6500000000000012,2.6500000000000012,2.6500000000000012,2.6500000000000012,2.6500000000000012,2.6500000000000012,2.6500000000000012,2.6500000000000012,2.6500000000000012,2.6500000000000012,2.6500000000000012,2.6500000000000012,2.6500000000000012,2.6500000000000012,2.6500000000000012,2.6500000000000012,2.6500000000000012,2.6500000000000012,2.6500000000000012,2.6500000000000012,2.6500000000000012,2.6500000000000012,2.6500000000000012,2.6500000000000012,2.6500000000000012,2.6500000000000012]
{"$rows_left_out":56}
{"sheet":"Math-DO-NOT-Delete","index":3,"n_rows":43,"n_cols":18,"rows_kept":43,"cut":false,"hidden":false,"merged":[]}
["prod_name_tm_na_en_us","Work Refractometer Factor Brix NA en-US","Work Titration Factor CGF 1 NA en-US","Work Digital Titration NA en-US","m_min_target_concentration","m_target_concentration","m_max_target_concentration","Yellow Rows",5,null,"Date Removed","REMOVED PRODUCT","%Brix RI Factor Digital Refractometer","Coolant Titration Factor CGF-1","Digital Titration Factor","m_min_target_concentration","m_target_concentration","m_max_target_concentration"]
["TRIM SOL®","1","6.25","0.225",6,7.5,9,"Display Factor",3.5,null,null,"TRIM® C275"]
["TRIM SOL® LC sf","1","","",6,7.5,9,"Total Rows",54,null,"2016-12-22","TRIM® CE/CE2 nd",1.05,"N/A","N/A",6,7.5,9]
["TRIM SOL® nd","1","6.25","0.225",6,7.5,9,null,null,null,null,"TRIM® CLEAR"]
["TRIM® 229","1.3","0.11","0.0032",0.5,1,2,null,null,null,null,"CoolPAK C2000"]
["TRIM® 9106","2.6","0.49","0.01",5,6,7,null,"Makeup",null,null,"TRIM® E190"]
["TRIM® C118","3.4","0.6","0.0189",6,7.5,9,null,0.1,null,null,"TRIM® MIST"]
["TRIM® C270","3.3","0.56","0.0175",6,7.5,9,null,0.2,null,null,"TRIM® MicroSol® 185 "]
["TRIM® C270 bd","3.3","0.561","0.0175",6,7.5,9,null,0.3,null,null,"TRIM® MicroSol® 555"]
["TRIM® C270CG","3.3","0.84","0.0201",6,7.5,9,null,0.4,null,null,"TRIM® MicroSol® 606slf"]
{"$rows_left_out":33}